Target
Substance-P receptor
Ligand
BDBM50030128
Substrate
Meas. Tech.
ChEMBL_143027 (CHEMBL880850)
IC50
243±n/a nM
Citation
 MacLeod, AMMerchant, KJBrookfield, FKelleher, FStevenson, GOwens, APSwain, CJCasiceri, MASadowski, SBer, E Identification of L-tryptophan derivatives with potent and selective antagonist activity at the NK1 receptor. J Med Chem 37:1269-74 (1994)  
Target
Name:
Substance-P receptor
Synonyms:
NK-1 receptor NK1 Receptor NK1R_HUMAN Neurokinin-1 (NK-1) SPR TACR1 Tachykinin receptor 1 (NK1) | tachykinin
Type:
G Protein-Coupled Receptor (GPCR)
Mol. Mass.:
46254.43
Organism:
Homo sapiens (Human)
Description:
P25103
Residue:
407
  
Inhibitor
Name:
BDBM50030128
Synonyms:
(S)-2-Benzoylamino-3-(1H-indol-3-yl)-propionic acid 4-chloro-benzyl ester | CHEMBL279500
Type:
Small organic molecule
Emp. Form.:
C25H21ClN2O3
Mol. Mass.:
432.899
SMILES:
Clc1ccc(COC(=O)[C@H](Cc2c[nH]c3ccccc23)NC(=O)c2ccccc2)cc1
: