Target
Substance-K receptor
Ligand
BDBM50030128
Substrate
Meas. Tech.
ChEMBL_143058 (CHEMBL750305)
IC50
>5000±n/a nM
Citation
 MacLeod, AMMerchant, KJBrookfield, FKelleher, FStevenson, GOwens, APSwain, CJCasiceri, MASadowski, SBer, E Identification of L-tryptophan derivatives with potent and selective antagonist activity at the NK1 receptor. J Med Chem 37:1269-74 (1994)  
Target
Name:
Substance-K receptor
Synonyms:
NK-2 receptor NK2R NKNAR Neurokinin A receptor Neurokinin-2 (NK-2) SKR TACR2 Tachykinin receptor 2 (NK2) | hnk-3
Type:
Protein
Mol. Mass.:
44455.78
Organism:
Homo sapiens (Human)
Description:
P21452
Residue:
398
  
Inhibitor
Name:
BDBM50030128
Synonyms:
(S)-2-Benzoylamino-3-(1H-indol-3-yl)-propionic acid 4-chloro-benzyl ester | CHEMBL279500
Type:
Small organic molecule
Emp. Form.:
C25H21ClN2O3
Mol. Mass.:
432.899
SMILES:
Clc1ccc(COC(=O)[C@H](Cc2c[nH]c3ccccc23)NC(=O)c2ccccc2)cc1
: