Target
Neuromedin-K receptor
Ligand
BDBM50030140
Substrate
Meas. Tech.
ChEMBL_143198 (CHEMBL747336)
IC50
>5000±n/a nM
Citation
 MacLeod, AMMerchant, KJBrookfield, FKelleher, FStevenson, GOwens, APSwain, CJCasiceri, MASadowski, SBer, E Identification of L-tryptophan derivatives with potent and selective antagonist activity at the NK1 receptor. J Med Chem 37:1269-74 (1994)  
Target
Name:
Neuromedin-K receptor
Synonyms:
NK-3 receptor NK3R NKR Neurokinin B receptor Neuromedin-3 receptor (NK-3R) Neuromedin-K receptor Neuromedin-K receptor (NK3) TAC3R Tachykinin receptor 3 | Tachykinin receptor 3 (NK3)
Type:
Enzyme
Mol. Mass.:
52221.96
Organism:
Homo sapiens (Human)
Description:
P29371
Residue:
465
  
Inhibitor
Name:
BDBM50030140
Synonyms:
CHEMBL281804 [1-(3,5-Dimethyl-benzyloxycarbonyl)-2-(1H-indol-3-yl)-ethyl]-trimethyl-ammonium
Type:
Small organic molecule
Emp. Form.:
C23H29N2O2
Mol. Mass.:
365.488
SMILES:
Cc1cc(C)cc(COC(=O)[C@H](Cc2c[nH]c3ccccc23)[N+](C)(C)C)c1
: