Target
Aryl hydrocarbon receptor
Ligand
BDBM23948
Substrate
Meas. Tech.
ChEMBL_911108 (CHEMBL3055293)
Ki
71449633±n/a nM
Citation
  TBA Med Chem Res 17:212-218 (2008)    Article 
Target
Name:
Aryl hydrocarbon receptor
Synonyms:
AHR BHLHE76 aryl hydrocarbon receptor precursor
Type:
PROTEIN
Mol. Mass.:
96143.77
Organism:
Homo sapiens (Human)
Description:
ChEMBL_1503828
Residue:
848
  
Inhibitor
Name:
BDBM23948
Synonyms:
1,3-dichloro-5-[(Z)-2-[4-(trifluoromethyl)phenyl]ethenyl]benzene | cis-Stilbene Derivative, 5i
Type:
Small organic molecule
Emp. Form.:
C15H9Cl2F3
Mol. Mass.:
317.133
SMILES:
FC(F)(F)c1ccc(\C=C/c2cc(Cl)cc(Cl)c2)cc1
: