Target
Glycogen synthase kinase-3 beta
Ligand
BDBM50474994
Substrate
Meas. Tech.
ChEMBL_911772 (CHEMBL3055876)
IC50
0.707946±n/a nM
Citation
  TBA Med Chem Res 16:461-467 (2007)    Article 
Target
Name:
Glycogen synthase kinase-3 beta
Synonyms:
GSK-3 beta GSK3B Glycogen synthase kinase 3 beta (GSK3B) Glycogen synthase kinase-3 beta (GSK-3B) Glycogen synthase kinase-3 beta (GSK3B) Glycogen synthase kinase-3beta (GSK3B) | Serine/threonine-protein kinase GSK3B
Type:
Enzyme
Mol. Mass.:
46756.38
Organism:
Homo sapiens (Human)
Description:
P49841
Residue:
420
  
Inhibitor
Name:
BDBM50474994
Synonyms:
Bisarylmaleimide 1
Type:
Small organic molecule
Emp. Form.:
C27H25N7O3
Mol. Mass.:
495.5325
SMILES:
O=C(N1CCCCC1)N1CCn2cc(C3=C(C(=O)NC3=O)c3cnc4cccnn34)c3cccc(C1)c23
: