Target
Type-1 angiotensin II receptor
Ligand
BDBM50044534
Substrate
Meas. Tech.
ChEMBL_911177 (CHEMBL3055839)
IC50
3.60±n/a nM
Citation
  TBA Med Chem Res 19:375-391 (2010)    Article 
Target
Name:
Type-1 angiotensin II receptor
Synonyms:
AGTR1 ANGIOTENSIN AT1 Angiotensin II type 1a (AT-1a) receptor
Type:
Enzyme Catalytic Domain
Mol. Mass.:
41009.15
Organism:
RABBIT
Description:
ANGIOTENSIN AT1 AGTR1 RABBIT::P34976
Residue:
359
  
Inhibitor
Name:
BDBM50044534
Synonyms:
2-Biphenyl-2-yl-5-butyl-4-[2'-(2H-tetrazol-5-yl)-biphenyl-4-ylmethyl]-2,4-dihydro-[1,2,4]triazol-3-one | CHEMBL315776
Type:
Small organic molecule
Emp. Form.:
C32H29N7O
Mol. Mass.:
527.619
SMILES:
CCCCc1nn(-c2ccccc2-c2ccccc2)c(=O)n1Cc1ccc(cc1)-c1ccccc1-c1nnn[nH]1
: