Target
Juvenile hormone esterase, isoform B
Ligand
BDBM50371970
Substrate
Meas. Tech.
ChEMBL_916867 (CHEMBL3082115)
IC50
1.6±n/a nM
Citation
 Wheelock, CESeverson, TFHammock, BD Synthesis of new carboxylesterase inhibitors and evaluation of potency and water solubility. Chem Res Toxicol 14:1563-72 (2001)  
Target
Name:
Juvenile hormone esterase, isoform B
Synonyms:
3.1.1.59 JHE-B Juvenile hormone esterase, isoform B
Type:
PROTEIN
Mol. Mass.:
6500.06
Organism:
Trichoplusia ni
Description:
ChEMBL_106713
Residue:
59
  
Inhibitor
Name:
BDBM50371970
Synonyms:
CHEMBL89506
Type:
Small organic molecule
Emp. Form.:
C11H19F3OS
Mol. Mass.:
256.328
SMILES:
CCCCCCCCSCC(=O)C(F)(F)F
: