Target
Liver carboxylesterase B-1
Ligand
BDBM50371970
Substrate
Meas. Tech.
ChEMBL_916866 (CHEMBL3082114)
IC50
37±n/a nM
Citation
 Wheelock, CESeverson, TFHammock, BD Synthesis of new carboxylesterase inhibitors and evaluation of potency and water solubility. Chem Res Toxicol 14:1563-72 (2001)  
Target
Name:
Liver carboxylesterase B-1
Synonyms:
3.1.1.1 Liver carboxylesterase B-1 | Liver microsomal carboxylesterase
Type:
PROTEIN
Mol. Mass.:
62495.56
Organism:
Rattus norvegicus
Description:
ChEMBL_106642
Residue:
561
  
Inhibitor
Name:
BDBM50371970
Synonyms:
CHEMBL89506
Type:
Small organic molecule
Emp. Form.:
C11H19F3OS
Mol. Mass.:
256.328
SMILES:
CCCCCCCCSCC(=O)C(F)(F)F
: