Target
Retinoic acid receptor RXR-alpha
Ligand
BDBM50033062
Substrate
Meas. Tech.
ChEMBL_196906 (CHEMBL807368)
EC50
2500±n/a nM
Citation
 Dawson, MIJong, LHobbs, PDCameron, JFChao, WRPfahl, MLee, MOShroot, BPfahl, M Conformational effects on retinoid receptor selectivity. 2. Effects of retinoid bridging group on retinoid X receptor activity and selectivity. J Med Chem 38:3368-83 (1995)  
Target
Name:
Retinoic acid receptor RXR-alpha
Synonyms:
NR2B1 Nuclear receptor subfamily 4 group A member 2 RXRA Retinoic acid receptor RXR-alpha/gamma Retinoid receptor
Type:
PROTEIN
Mol. Mass.:
50820.38
Organism:
Homo sapiens (Human)
Description:
ChEMBL_1456363
Residue:
462
  
Inhibitor
Name:
BDBM50033062
Synonyms:
4-(5,5,8,8-Tetramethyl-5,6,7,8-tetrahydro-naphthalen-2-yloxy)-benzoic acid | CHEMBL116859
Type:
Small organic molecule
Emp. Form.:
C21H24O3
Mol. Mass.:
324.4135
SMILES:
CC1(C)CCC(C)(C)c2cc(Oc3ccc(cc3)C(O)=O)ccc12
: