Target
Retinoic acid receptor RXR-beta
Ligand
BDBM50033069
Substrate
Meas. Tech.
ChEMBL_197075 (CHEMBL806663)
EC50
140±n/a nM
Citation
 Dawson, MIJong, LHobbs, PDCameron, JFChao, WRPfahl, MLee, MOShroot, BPfahl, M Conformational effects on retinoid receptor selectivity. 2. Effects of retinoid bridging group on retinoid X receptor activity and selectivity. J Med Chem 38:3368-83 (1995)  
Target
Name:
Retinoic acid receptor RXR-beta
Synonyms:
NR2B2 RXRB Retinoic acid receptor RXR-beta Retinoid receptor
Type:
PROTEIN
Mol. Mass.:
56932.89
Organism:
Homo sapiens (Human)
Description:
ChEMBL_39045
Residue:
533
  
Inhibitor
Name:
BDBM50033069
Synonyms:
(2E,4E)-3,7-Dimethyl-6-(3,5,5,8,8-pentamethyl-5,6,7,8-tetrahydro-naphthalen-2-yl)-octa-2,4,6-trienoic acid | CHEMBL115164
Type:
Small organic molecule
Emp. Form.:
C25H34O2
Mol. Mass.:
366.5363
SMILES:
[#6]\[#6](-[#6])=[#6](\[#6]=[#6]\[#6](\[#6])=[#6]\[#6](-[#8])=O)/c1cc2c(cc1-[#6])C([#6])([#6])[#6]-[#6]C2([#6])[#6]
: