Target
Retinoic acid receptor RXR-gamma
Ligand
BDBM50033066
Substrate
Meas. Tech.
ChEMBL_197234 (CHEMBL801380)
EC50
1700±n/a nM
Citation
 Dawson, MIJong, LHobbs, PDCameron, JFChao, WRPfahl, MLee, MOShroot, BPfahl, M Conformational effects on retinoid receptor selectivity. 2. Effects of retinoid bridging group on retinoid X receptor activity and selectivity. J Med Chem 38:3368-83 (1995)  
Target
Name:
Retinoic acid receptor RXR-gamma
Synonyms:
NR2B3 RXRG Retinoic acid receptor RXR-gamma Retinoid X receptor gamma/retinoic acid receptor alpha
Type:
PROTEIN
Mol. Mass.:
50878.26
Organism:
Homo sapiens (Human)
Description:
ChEMBL_197216
Residue:
463
  
Inhibitor
Name:
BDBM50033066
Synonyms:
4-(5,5,8,8-Tetramethyl-5,6,7,8-tetrahydro-naphthalene-2-carbonyl)-benzoic acid | CHEMBL101308
Type:
Small organic molecule
Emp. Form.:
C22H24O3
Mol. Mass.:
336.4242
SMILES:
CC1(C)CCC(C)(C)c2cc(ccc12)C(=O)c1ccc(cc1)C(O)=O
: