Target
Retinoic acid receptor RXR-alpha
Ligand
BDBM50033068
Substrate
Meas. Tech.
ChEMBL_196906 (CHEMBL807368)
EC50
21±n/a nM
Citation
 Dawson, MIJong, LHobbs, PDCameron, JFChao, WRPfahl, MLee, MOShroot, BPfahl, M Conformational effects on retinoid receptor selectivity. 2. Effects of retinoid bridging group on retinoid X receptor activity and selectivity. J Med Chem 38:3368-83 (1995)  
Target
Name:
Retinoic acid receptor RXR-alpha
Synonyms:
NR2B1 Nuclear receptor subfamily 4 group A member 2 RXRA Retinoic acid receptor RXR-alpha/gamma Retinoid receptor
Type:
PROTEIN
Mol. Mass.:
50820.38
Organism:
Homo sapiens (Human)
Description:
ChEMBL_1456363
Residue:
462
  
Inhibitor
Name:
BDBM50033068
Synonyms:
(2E,4E)-3-Methyl-5-[2-(3,5,5,8,8-pentamethyl-5,6,7,8-tetrahydro-naphthalen-2-yl)-[1,3]dioxolan-2-yl]-penta-2,4-dienoic acid | CHEMBL111911
Type:
Small organic molecule
Emp. Form.:
C24H32O4
Mol. Mass.:
384.5085
SMILES:
C\C(\C=C\C1(OCCO1)c1cc2c(cc1C)C(C)(C)CCC2(C)C)=C/C(O)=O
: