Target
Retinoic acid receptor RXR-gamma
Ligand
BDBM50033065
Substrate
Meas. Tech.
ChEMBL_197234 (CHEMBL801380)
EC50
520±n/a nM
Citation
 Dawson, MIJong, LHobbs, PDCameron, JFChao, WRPfahl, MLee, MOShroot, BPfahl, M Conformational effects on retinoid receptor selectivity. 2. Effects of retinoid bridging group on retinoid X receptor activity and selectivity. J Med Chem 38:3368-83 (1995)  
Target
Name:
Retinoic acid receptor RXR-gamma
Synonyms:
NR2B3 RXRG Retinoic acid receptor RXR-gamma Retinoid X receptor gamma/retinoic acid receptor alpha
Type:
PROTEIN
Mol. Mass.:
50878.26
Organism:
Homo sapiens (Human)
Description:
ChEMBL_197216
Residue:
463
  
Inhibitor
Name:
BDBM50033065
Synonyms:
(2E,4E)-3,7-Dimethyl-6-(5,5,8,8-tetramethyl-5,6,7,8-tetrahydro-naphthalen-2-yl)-octa-2,4,6-trienoic acid | CHEMBL414233
Type:
Small organic molecule
Emp. Form.:
C24H32O2
Mol. Mass.:
352.5097
SMILES:
[#6]\[#6](-[#6])=[#6](\[#6]=[#6]\[#6](\[#6])=[#6]\[#6](-[#8])=O)/c1ccc2c(c1)C([#6])([#6])[#6]-[#6]C2([#6])[#6]
: