Target
Protein ultraspiracle
Ligand
BDBM50488458
Substrate
Meas. Tech.
ChEMBL_925682 (CHEMBL3069808)
EC50
9772±n/a nM
Citation
 Soin, TSwevers, LKotzia, GIatrou, KJanssen, CRRougé, PHarada, TNakagawa, YSmagghe, G Comparison of the activity of non-steroidal ecdysone agonists between dipteran and lepidopteran insects, using cell-based EcR reporter assays. Pest Manag Sci 66:1215-29 (2010)  
Target
Name:
Protein ultraspiracle
Synonyms:
Cf1 NR2B4 USP_DROME usp
Type:
PROTEIN
Mol. Mass.:
55254.53
Organism:
Drosophila melanogaster
Description:
ChEMBL_106725
Residue:
508
  
Inhibitor
Name:
BDBM50488458
Synonyms:
CHEMBL2286427
Type:
Small organic molecule
Emp. Form.:
C21H25ClN2O2
Mol. Mass.:
372.888
SMILES:
CCCc1ccc(cc1)C(=O)NN(C(=O)c1ccccc1Cl)C(C)(C)C
: