Target
Protein ultraspiracle
Ligand
BDBM50488533
Substrate
Meas. Tech.
ChEMBL_925682 (CHEMBL3069808)
EC50
25704±n/a nM
Citation
 Soin, TSwevers, LKotzia, GIatrou, KJanssen, CRRougé, PHarada, TNakagawa, YSmagghe, G Comparison of the activity of non-steroidal ecdysone agonists between dipteran and lepidopteran insects, using cell-based EcR reporter assays. Pest Manag Sci 66:1215-29 (2010)  
Target
Name:
Protein ultraspiracle
Synonyms:
Cf1 NR2B4 USP_DROME usp
Type:
PROTEIN
Mol. Mass.:
55254.53
Organism:
Drosophila melanogaster
Description:
ChEMBL_106725
Residue:
508
  
Inhibitor
Name:
BDBM50488533
Synonyms:
CHEMBL2286746
Type:
Small organic molecule
Emp. Form.:
C18H18ClFN2O2
Mol. Mass.:
348.799
SMILES:
CC(C)(C)N(NC(=O)c1cccc(F)c1)C(=O)c1ccccc1Cl
: