Target
Thymidylate synthase
Ligand
BDBM50035005
Substrate
Meas. Tech.
ChEMBL_209776 (CHEMBL815566)
Ki
25±n/a nM
Citation
 Varney, MDPalmer, CLDeal, JGWebber, SWelsh, KMBartlett, CAMorse, CASmith, WWJanson, CA Synthesis and biological evaluation of novel 2,6-diaminobenz[cd]indole inhibitors of thymidylate synthase using the protein structure as a guide. J Med Chem 38:1892-903 (1995)  
Target
Name:
Thymidylate synthase
Synonyms:
TS TYMS Thymidylate synthase (TS) | Thymidylate synthase/GAR transformylase/AICAR transformylase
Type:
Enzyme
Mol. Mass.:
35718.07
Organism:
Homo sapiens (Human)
Description:
Residue:
313
  
Inhibitor
Name:
BDBM50035005
Synonyms:
CHEMBL56611 | N*6*-(2-Ethyl-pyridin-4-ylmethyl)-N*6*-methyl-benzo[cd]indole-2,6-diamine
Type:
Small organic molecule
Emp. Form.:
C20H20N4
Mol. Mass.:
316.3996
SMILES:
CCc1cc(CN(C)c2ccc3N=C(N)c4cccc2c34)ccn1
: