Target
Thymidylate synthase
Ligand
BDBM50035012
Substrate
Meas. Tech.
ChEMBL_209776 (CHEMBL815566)
Ki
10±n/a nM
Citation
 Varney, MDPalmer, CLDeal, JGWebber, SWelsh, KMBartlett, CAMorse, CASmith, WWJanson, CA Synthesis and biological evaluation of novel 2,6-diaminobenz[cd]indole inhibitors of thymidylate synthase using the protein structure as a guide. J Med Chem 38:1892-903 (1995)  
Target
Name:
Thymidylate synthase
Synonyms:
TS TYMS Thymidylate synthase (TS) | Thymidylate synthase/GAR transformylase/AICAR transformylase
Type:
Enzyme
Mol. Mass.:
35718.07
Organism:
Homo sapiens (Human)
Description:
Residue:
313
  
Inhibitor
Name:
BDBM50035012
Synonyms:
5,N*6*-Dimethyl-N*6*-pyridazin-4-ylmethyl-benzo[cd]indole-2,6-diamine | CHEMBL57420
Type:
Small organic molecule
Emp. Form.:
C18H17N5
Mol. Mass.:
303.3611
SMILES:
CN(Cc1ccnnc1)c1ccc2N=C(N)c3ccc(C)c1c23
: