Target
Aromatase
Ligand
BDBM50035204
Substrate
Meas. Tech.
ChEMBL_50688 (CHEMBL662434)
IC50
10000±n/a nM
Citation
 Hartmann, RWBayer, HGrün, GSergejew, TBartz, UMitrenga, M Pyridyl-substituted tetrahydrocyclopropa[a]naphthalenes: highly active and selective inhibitors of P450 arom. J Med Chem 38:2103-11 (1995)  
Target
Name:
Aromatase
Synonyms:
ARO1 CP19A_HUMAN CYP19 CYPXIX Cytochrome P450 19A1 Cytochrome P450-C19 (CYP19) FL cytokine receptor precursor | P-450AROM
Type:
Enzyme
Mol. Mass.:
57888.92
Organism:
Homo sapiens (Human)
Description:
P11511
Residue:
503
  
Inhibitor
Name:
BDBM50035204
Synonyms:
4-(6-Methoxy-1a,2,3,7b-tetrahydro-1H-cyclopropa[a]naphthalen-1-yl)-pyridine CHEMBL294361
Type:
Small organic molecule
Emp. Form.:
C17H17NO
Mol. Mass.:
251.323
SMILES:
COc1ccc2CCC3C(C3c2c1)c1ccncc1
: