Target
Cytochrome P450 11B1, mitochondrial
Ligand
BDBM50035204
Substrate
Meas. Tech.
ChEMBL_177002 (CHEMBL779292)
IC50
30000±n/a nM
Citation
 Hartmann, RWBayer, HGrün, GSergejew, TBartz, UMitrenga, M Pyridyl-substituted tetrahydrocyclopropa[a]naphthalenes: highly active and selective inhibitors of P450 arom. J Med Chem 38:2103-11 (1995)  
Target
Name:
Cytochrome P450 11B1, mitochondrial
Synonyms:
C11B1_HUMAN CYPXIB1 Cytochrome P450 11B1 Cytochrome P450 11B1, mitochondrial | S11BH
Type:
Enzyme
Mol. Mass.:
57591.44
Organism:
Homo sapiens (Human)
Description:
P15538
Residue:
503
  
Inhibitor
Name:
BDBM50035204
Synonyms:
4-(6-Methoxy-1a,2,3,7b-tetrahydro-1H-cyclopropa[a]naphthalen-1-yl)-pyridine CHEMBL294361
Type:
Small organic molecule
Emp. Form.:
C17H17NO
Mol. Mass.:
251.323
SMILES:
COc1ccc2CCC3C(C3c2c1)c1ccncc1
: