Target
Aromatase
Ligand
BDBM50035204
Substrate
Meas. Tech.
ChEMBL_51215 (CHEMBL664334)
IC50
265±n/a nM
Citation
 Hartmann, RWBayer, HGrün, GSergejew, TBartz, UMitrenga, M Pyridyl-substituted tetrahydrocyclopropa[a]naphthalenes: highly active and selective inhibitors of P450 arom. J Med Chem 38:2103-11 (1995)  
Target
Name:
Aromatase
Synonyms:
Arom CP19A_RAT Cyp19 Cytochrome P450 19A1 P-450AROM
Type:
PROTEIN
Mol. Mass.:
58418.09
Organism:
Rattus norvegicus
Description:
ChEMBL_51211
Residue:
508
  
Inhibitor
Name:
BDBM50035204
Synonyms:
4-(6-Methoxy-1a,2,3,7b-tetrahydro-1H-cyclopropa[a]naphthalen-1-yl)-pyridine CHEMBL294361
Type:
Small organic molecule
Emp. Form.:
C17H17NO
Mol. Mass.:
251.323
SMILES:
COc1ccc2CCC3C(C3c2c1)c1ccncc1
: