Target
Muscarinic acetylcholine receptor M5
Ligand
BDBM50035280
Substrate
Meas. Tech.
ChEMBL_139384 (CHEMBL747137)
EC50
110±n/a nM
Citation
 Bräuner-Osborne, HEbert, BBrann, MRFalch, EKrogsgaard-Larsen, P Annulated heterocyclic bioisosteres of norarecoline. Synthesis and molecular pharmacology at five recombinant human muscarinic acetylcholine receptors. J Med Chem 38:2188-95 (1995)  
Target
Name:
Muscarinic acetylcholine receptor M5
Synonyms:
ACM5_HUMAN | CHRM5
Type:
PROTEIN
Mol. Mass.:
60102.35
Organism:
Homo sapiens (Human)
Description:
ChEMBL_1517990
Residue:
532
  
Inhibitor
Name:
BDBM50035280
Synonyms:
3-Isopropoxy-5,6,7,8-tetrahydro-4H-isoxazolo[4,5-c]azepine | CHEMBL305264
Type:
Small organic molecule
Emp. Form.:
C10H16N2O2
Mol. Mass.:
196.2462
SMILES:
CC(C)Oc1noc2CCCNCc12
: