Target
Polyunsaturated fatty acid 5-lipoxygenase
Ligand
BDBM50036029
Substrate
Meas. Tech.
ChEMBL_4050 (CHEMBL621501)
IC50
2900±n/a nM
Citation
 Satoh, YPowers, CToledo, LMKowalski, TJPeters, PAKimble, EF Derivatives of 2-[[N-(Aminocarbonyl)-N-hydroxyamino]methyl]-1,4- benzodioxan as orally active 5-lipoxygenase inhibitors. J Med Chem 38:68-75 (1995)  
Target
Name:
Polyunsaturated fatty acid 5-lipoxygenase
Synonyms:
5-LO 5-Lipoxygenase (5-LO) 5-Lipoygenase ALOX5 LOG5 | LOX5_HUMAN
Type:
Enzyme
Mol. Mass.:
77972.74
Organism:
Homo sapiens (Human)
Description:
Recombinant protein was purified from E. coli lysate. After ammonium sulfate precipitation and subsequent steps, the supernatant (S100) was used for 5-LO activity assay.
Residue:
674
  
Inhibitor
Name:
BDBM50036029
Synonyms:
2-[[N-[(N`-benzylamino)carbonyl]-N-hydroxyamino]methyl]-1,4-benzodioxan | CHEMBL165855
Type:
Small organic molecule
Emp. Form.:
C17H18N2O4
Mol. Mass.:
314.3358
SMILES:
ON(CC1COc2ccccc2O1)C(=O)NCc1ccccc1
: