Target
Sodium- and chloride-dependent GABA transporter 3
Ligand
BDBM50020891
Substrate
Meas. Tech.
ChEMBL_962081 (CHEMBL2388198)
IC50
194984±n/a nM
Citation
 Quandt, GHöfner, GWanner, KT Synthesis and evaluation of N-substituted nipecotic acid derivatives with an unsymmetrical bis-aromatic residue attached to a vinyl ether spacer as potential GABA uptake inhibitors. Bioorg Med Chem 21:3363-78 (2013)  
Target
Name:
Sodium- and chloride-dependent GABA transporter 3
Synonyms:
GABA transporter Gabt3 Gat-4 Gat4 Slc6a11 Sodium- and chloride-dependent GABA transporter 4 | Solute carrier family 6 member 11
Type:
PROTEIN
Mol. Mass.:
69962.73
Organism:
Mus musculus
Description:
ChEMBL_1460090
Residue:
627
  
Inhibitor
Name:
BDBM50020891
Synonyms:
(R)-1-(4,4-Diphenyl-but-3-enyl)-piperidine-3-carboxylic acid CHEMBL77626
Type:
Small organic molecule
Emp. Form.:
C22H25NO2
Mol. Mass.:
335.4394
SMILES:
[#8]-[#6](=O)-[#6@@H]-1-[#6]-[#6]-[#6]-[#7](-[#6]-[#6]\[#6]=[#6](/c2ccccc2)-c2ccccc2)-[#6]-1
: