Target
Neutrophil elastase
Ligand
BDBM50037344
Substrate
Meas. Tech.
ChEMBL_63836 (CHEMBL674886)
Ki
4.8±n/a nM
Citation
 Bernstein, PRAndisik, DBradley, PKBryant, CBCeccarelli, CDamewood, JREarley, REdwards, PDFeeney, SGomes, BC Nonpeptidic inhibitors of human leukocyte elastase. 3. Design, synthesis, X-ray crystallographic analysis, and structure-activity relationships for a series of orally active 3-amino-6-phenylpyridin-2-one trifluoromethyl ketones. J Med Chem 37:3313-26 (1994)  
Target
Name:
Neutrophil elastase
Synonyms:
Bone marrow serine protease Coagulation factor X ELANE Elastase HLE Leukocyte elastase Medullasin Neutrophil elastase (HNE) PMN elastase Trypsin
Type:
Enzyme
Mol. Mass.:
28532.38
Organism:
Homo sapiens (Human)
Description:
P08246
Residue:
267
  
Inhibitor
Name:
BDBM50037344
Synonyms:
3-{2-Oxo-6-phenyl-1-[(3,3,3-trifluoro-1-isopropyl-2-oxo-propylcarbamoyl)-methyl]-1,2-dihydro-pyridin-3-ylcarbamoyloxymethyl}-benzoic acid | CHEMBL333835
Type:
Small organic molecule
Emp. Form.:
C28H26F3N3O7
Mol. Mass.:
573.5171
SMILES:
CC(C)C(NC(=O)Cn1c(ccc(NC(=O)OCc2cccc(c2)C(O)=O)c1=O)-c1ccccc1)C(=O)C(F)(F)F
: