Target
Delta-type opioid receptor
Ligand
BDBM50066280
Substrate
Meas. Tech.
ChEMBL_980540 (CHEMBL2422699)
Ki
17±n/a nM
Citation
 Yuan, YElbegdorj, OBeletskaya, IOSelley, DEZhang, Y Structure activity relationship studies of 17-cyclopropylmethyl-3,14?-dihydroxy-4,5?-epoxy-6?-(isoquinoline-3'-carboxamido)morphinan (NAQ) analogues as potent opioid receptor ligands: preliminary results on the role of electronic characteristics for affinity and function. Bioorg Med Chem Lett 23:5045-8 (2013)  
Target
Name:
Delta-type opioid receptor
Synonyms:
DOR-1 MSL-2 OPRD_MOUSE Oprd1
Type:
Enzyme Catalytic Domain
Mol. Mass.:
40577.25
Organism:
MOUSE
Description:
P32300
Residue:
372
  
Inhibitor
Name:
BDBM50066280
Synonyms:
CHEMBL2419122
Type:
Small organic molecule
Emp. Form.:
C30H30ClN3O5
Mol. Mass.:
548.029
SMILES:
[H][C@@]12Oc3c4c(C[C@@]5([H])N(CC6CC6)CC[C@@]14[C@@]5(O)CC[C@@H]2NC(=O)c1nc(Cl)c2ccccc2c1O)ccc3O
: