Target
Mu-type opioid receptor
Ligand
BDBM50066280
Substrate
Meas. Tech.
ChEMBL_980542 (CHEMBL2422701)
Ki
0.730000±n/a nM
Citation
 Yuan, YElbegdorj, OBeletskaya, IOSelley, DEZhang, Y Structure activity relationship studies of 17-cyclopropylmethyl-3,14?-dihydroxy-4,5?-epoxy-6?-(isoquinoline-3'-carboxamido)morphinan (NAQ) analogues as potent opioid receptor ligands: preliminary results on the role of electronic characteristics for affinity and function. Bioorg Med Chem Lett 23:5045-8 (2013)  
Target
Name:
Mu-type opioid receptor
Synonyms:
M-OR-1 Mor OPRM_MOUSE Oprm | Oprm1
Type:
Enzyme Catalytic Domain
Mol. Mass.:
44431.62
Organism:
MOUSE
Description:
OPIATE Mu OPRM1 MOUSE::P42866
Residue:
398
  
Inhibitor
Name:
BDBM50066280
Synonyms:
CHEMBL2419122
Type:
Small organic molecule
Emp. Form.:
C30H30ClN3O5
Mol. Mass.:
548.029
SMILES:
[H][C@@]12Oc3c4c(C[C@@]5([H])N(CC6CC6)CC[C@@]14[C@@]5(O)CC[C@@H]2NC(=O)c1nc(Cl)c2ccccc2c1O)ccc3O
: