Target
Sterol O-acyltransferase 1
Ligand
BDBM50038909
Substrate
Meas. Tech.
ChEMBL_28505 (CHEMBL645934)
IC50
28.7±n/a nM
Citation
 Tawada, HHarcourt, MKawamura, NKajino, MIshikawa, ESugiyama, YIkeda, HMeguro, K Novel acyl-CoA:cholesterol acyltransferase inhibitors. Synthesis and biological activity of 3-quinolylurea derivatives. J Med Chem 37:2079-84 (1994)  
Target
Name:
Sterol O-acyltransferase 1
Synonyms:
ACAT-1 Acat SOAT1_RAT Sterol O-acyltransferase, Soat
Type:
PROTEIN
Mol. Mass.:
64165.56
Organism:
Rattus norvegicus
Description:
ChEMBL_28796
Residue:
545
  
Inhibitor
Name:
BDBM50038909
Synonyms:
1-(6-Chloro-4-o-tolyl-quinolin-3-yl)-3-(2,4-difluoro-phenyl)-urea | CHEMBL63593
Type:
Small organic molecule
Emp. Form.:
C23H16ClF2N3O
Mol. Mass.:
423.842
SMILES:
Cc1ccccc1-c1c(NC(=O)Nc2ccc(F)cc2F)cnc2ccc(Cl)cc12
: