Target
Sterol O-acyltransferase 1
Ligand
BDBM50038908
Substrate
Meas. Tech.
ChEMBL_28505 (CHEMBL645934)
IC50
125±n/a nM
Citation
 Tawada, HHarcourt, MKawamura, NKajino, MIshikawa, ESugiyama, YIkeda, HMeguro, K Novel acyl-CoA:cholesterol acyltransferase inhibitors. Synthesis and biological activity of 3-quinolylurea derivatives. J Med Chem 37:2079-84 (1994)  
Target
Name:
Sterol O-acyltransferase 1
Synonyms:
ACAT-1 Acat SOAT1_RAT Sterol O-acyltransferase, Soat
Type:
PROTEIN
Mol. Mass.:
64165.56
Organism:
Rattus norvegicus
Description:
ChEMBL_28796
Residue:
545
  
Inhibitor
Name:
BDBM50038908
Synonyms:
1-[4-(2-Chloro-phenyl)-quinolin-3-yl]-3-(2,4-difluoro-phenyl)-urea | CHEMBL65347
Type:
Small organic molecule
Emp. Form.:
C22H14ClF2N3O
Mol. Mass.:
409.816
SMILES:
Fc1ccc(NC(=O)Nc2cnc3ccccc3c2-c2ccccc2Cl)c(F)c1
: