Target
Sterol O-acyltransferase 1
Ligand
BDBM50038913
Substrate
Meas. Tech.
ChEMBL_28505 (CHEMBL645934)
IC50
90.6±n/a nM
Citation
 Tawada, HHarcourt, MKawamura, NKajino, MIshikawa, ESugiyama, YIkeda, HMeguro, K Novel acyl-CoA:cholesterol acyltransferase inhibitors. Synthesis and biological activity of 3-quinolylurea derivatives. J Med Chem 37:2079-84 (1994)  
Target
Name:
Sterol O-acyltransferase 1
Synonyms:
ACAT-1 Acat SOAT1_RAT Sterol O-acyltransferase, Soat
Type:
PROTEIN
Mol. Mass.:
64165.56
Organism:
Rattus norvegicus
Description:
ChEMBL_28796
Residue:
545
  
Inhibitor
Name:
BDBM50038913
Synonyms:
1-[6-Chloro-4-(3-chloro-phenyl)-quinolin-3-yl]-3-(2,4-difluoro-phenyl)-urea | CHEMBL303527
Type:
Small organic molecule
Emp. Form.:
C22H13Cl2F2N3O
Mol. Mass.:
444.261
SMILES:
Fc1ccc(NC(=O)Nc2cnc3ccc(Cl)cc3c2-c2cccc(Cl)c2)c(F)c1
: