Target
Epidermal growth factor receptor
Ligand
BDBM3294
Substrate
Meas. Tech.
ChEMBL_982643 (CHEMBL2428432)
IC50
21±n/a nM
Citation
 Vacondio, FCarmi, CGalvani, EBassi, MSilva, CLodola, ARivara, SCavazzoni, AAlfieri, RRPetronini, PGMor, M Long-lasting inhibition of EGFR autophosphorylation in A549 tumor cells by intracellular accumulation of non-covalent inhibitors. Bioorg Med Chem Lett 23:5290-4 (2013)  
Target
Name:
Epidermal growth factor receptor
Synonyms:
EGF Receptor Substrate EGFR_HUMAN ERBB1 Epidermal Growth Factor Receptor erbB-1 Epidermal growth factor receptor (EGFR) HER1 Proto-oncogene c-ErbB-1 Tyrosine-Protein Kinase ErbB-1
Type:
Receptor Kinase Domain
Mol. Mass.:
134279.59
Organism:
Homo sapiens (Human)
Description:
P00533
Residue:
1210
  
Inhibitor
Name:
BDBM3294
Synonyms:
4-Anilinoquinazoline deriv. 45 Anilinoquinazoline, 4b | CHEMBL52765
Type:
Small organic molecule
Emp. Form.:
C14H11BrN4
Mol. Mass.:
315.168
SMILES:
Nc1ccc2ncnc(Nc3cccc(Br)c3)c2c1
: