Target
Epidermal growth factor receptor
Ligand
BDBM50307932
Substrate
Meas. Tech.
ChEMBL_982643 (CHEMBL2428432)
IC50
50±n/a nM
Citation
 Vacondio, FCarmi, CGalvani, EBassi, MSilva, CLodola, ARivara, SCavazzoni, AAlfieri, RRPetronini, PGMor, M Long-lasting inhibition of EGFR autophosphorylation in A549 tumor cells by intracellular accumulation of non-covalent inhibitors. Bioorg Med Chem Lett 23:5290-4 (2013)  
Target
Name:
Epidermal growth factor receptor
Synonyms:
EGF Receptor Substrate EGFR_HUMAN ERBB1 Epidermal Growth Factor Receptor erbB-1 Epidermal growth factor receptor (EGFR) HER1 Proto-oncogene c-ErbB-1 Tyrosine-Protein Kinase ErbB-1
Type:
Receptor Kinase Domain
Mol. Mass.:
134279.59
Organism:
Homo sapiens (Human)
Description:
P00533
Residue:
1210
  
Inhibitor
Name:
BDBM50307932
Synonyms:
CHEMBL597402 | N-(4-(3-Bromoanilino)quinazolin-6-yl)-2-(perfluorophenoxy)-acetamide
Type:
Small organic molecule
Emp. Form.:
C22H12BrF5N4O2
Mol. Mass.:
539.252
SMILES:
Fc1c(F)c(F)c(OCC(=O)Nc2ccc3ncnc(Nc4cccc(Br)c4)c3c2)c(F)c1F
: