Target
Epidermal growth factor receptor
Ligand
BDBM50493385
Substrate
Meas. Tech.
ChEMBL_982642 (CHEMBL2428431)
IC50
14±n/a nM
Citation
 Vacondio, FCarmi, CGalvani, EBassi, MSilva, CLodola, ARivara, SCavazzoni, AAlfieri, RRPetronini, PGMor, M Long-lasting inhibition of EGFR autophosphorylation in A549 tumor cells by intracellular accumulation of non-covalent inhibitors. Bioorg Med Chem Lett 23:5290-4 (2013)  
Target
Name:
Epidermal growth factor receptor
Synonyms:
EGF Receptor Substrate EGFR_HUMAN ERBB1 Epidermal Growth Factor Receptor erbB-1 Epidermal growth factor receptor (EGFR) HER1 Proto-oncogene c-ErbB-1 Tyrosine-Protein Kinase ErbB-1
Type:
Receptor Kinase Domain
Mol. Mass.:
134279.59
Organism:
Homo sapiens (Human)
Description:
P00533
Residue:
1210
  
Inhibitor
Name:
BDBM50493385
Synonyms:
CHEMBL2425735
Type:
Small organic molecule
Emp. Form.:
C23H26BrN5O
Mol. Mass.:
468.389
SMILES:
Brc1cccc(Nc2ncnc3ccc(NC(=O)CCCN4CCCCC4)cc23)c1
: