Target
D(1A) dopamine receptor
Ligand
BDBM50010594
Substrate
Meas. Tech.
ChEBML_58668
Ki
28±n/a nM
Citation
 Liégeois, JFBruhwyler, JDamas, JNguyen, TPChleide, EMMercier, MGRogister, FADelarge, JE New pyridobenzodiazepine derivatives as potential antipsychotics: synthesis and neurochemical study. J Med Chem 36:2107-14 (1993)  
Target
Name:
D(1A) dopamine receptor
Synonyms:
DOPAMINE D1 Dopamine D1 high Dopamine receptor Dopamine1-like Drd1a
Type:
Enzyme Catalytic Domain
Mol. Mass.:
49429.75
Organism:
RAT
Description:
P18901
Residue:
446
  
Inhibitor
Name:
BDBM50010594
Synonyms:
2-Chloro-11-(4-methyl-piperazin-1-yl)-5H-dibenzo[b,e][1,4]diazepine CHEMBL415300 | ISOCLOZAPINE
Type:
Small organic molecule
Emp. Form.:
C18H19ClN4
Mol. Mass.:
326.823
SMILES:
CN1CCN(CC1)C1=Nc2ccccc2Nc2ccc(Cl)cc12
: