Target
Interstitial collagenase
Ligand
BDBM50040579
Substrate
Meas. Tech.
ChEMBL_101733 (CHEMBL709089)
IC50
41±n/a nM
Citation
 Brown, FKBrown, PJBickett, DMChambers, CLDavies, HGDeaton, DNDrewry, DFoley, MMcElroy, ABGregson, M Matrix metalloproteinase inhibitors containing a (carboxyalkyl)amino zinc ligand: modification of the P1 and P2' residues. J Med Chem 37:674-88 (1994)  
Target
Name:
Interstitial collagenase
Synonyms:
CLG MMP1 Matrix metalloproteinase-1 | Matrix metalloproteinase-1 (MMP-1)
Type:
Enzyme
Mol. Mass.:
54010.26
Organism:
Homo sapiens (Human)
Description:
P03956
Residue:
469
  
Inhibitor
Name:
BDBM50040579
Synonyms:
(R)-4-(1,3-Dioxo-1,3-dihydro-benzo[f]isoindol-2-yl)-2-[(S)-1-(3-fluoro-benzylcarbamoyl)-3-methyl-butylamino]-butyric acid | CHEMBL348826
Type:
Small organic molecule
Emp. Form.:
C29H30FN3O5
Mol. Mass.:
519.564
SMILES:
CC(C)C[C@H](N[C@H](CCN1C(=O)c2cc3ccccc3cc2C1=O)C(O)=O)C(=O)NCc1cccc(F)c1
: