Target
Delta-type opioid receptor
Ligand
BDBM50266860
Substrate
Meas. Tech.
ChEMBL_1277416 (CHEMBL3089527)
Ki
>10000±n/a nM
Citation
 Yuan, YZaidi, SAElbegdorj, OAschenbach, LCLi, GStevens, DLScoggins, KLDewey, WLSelley, DEZhang, Y Design, synthesis, and biological evaluation of 14-heteroaromatic-substituted naltrexone derivatives: pharmacological profile switch from mu opioid receptor selectivity to mu/kappa opioid receptor dual selectivity. J Med Chem 56:9156-69 (2013)  
Target
Name:
Delta-type opioid receptor
Synonyms:
D-OR-1 Delta opioid receptor OPIATE Delta OPRD1 OPRK1 | opioid receptor, delta 1
Type:
G Protein-Coupled Receptor (GPCR)
Mol. Mass.:
40382.98
Organism:
Homo sapiens (Human)
Description:
Competition binding assays were carried out using membrane preparations from transfected HN9.10 cells that constitutively expressed the delta opioid receptor.
Residue:
372
  
Inhibitor
Name:
BDBM50266860
Synonyms:
(1S,5R,13R,17S)-4-(cyclopropylmethyl)-10-hydroxy-14-oxo-12-oxa-4-azapentacyclo[9.6.1.0^{1,13}.0^{5,17}.0^{7,18}]octadeca-7(18),8,10-trien-17-yl benzoate | CHEMBL516263
Type:
Small organic molecule
Emp. Form.:
C27H27NO5
Mol. Mass.:
445.507
SMILES:
Oc1ccc2C[C@H]3N(CC4CC4)CC[C@@]45[C@@H](Oc1c24)C(=O)CC[C@@]35OC(=O)c1ccccc1
: