Target
Dual specificity mitogen-activated protein kinase kinase 1
Ligand
BDBM50494482
Substrate
Meas. Tech.
ChEMBL_1279378 (CHEMBL3096357)
IC50
38±n/a nM
Citation
 Hyohdoh, IFuruichi, NAoki, TItezono, YShirai, HOzawa, SWatanabe, FMatsushita, MSakaitani, MHo, PSTakanashi, KHarada, NTomii, YYoshinari, KOri, KTabo, MAoki, YShimma, NIikura, H Fluorine Scanning by Nonselective Fluorination: Enhancing Raf/MEK Inhibition while Keeping Physicochemical Properties. ACS Med Chem Lett 4:1059-63 (2013)  
Target
Name:
Dual specificity mitogen-activated protein kinase kinase 1
Synonyms:
Dual specificity mitogen-activated protein kinase (MEK) Dual specificity mitogen-activated protein kinase kinase 1 (MEK1) Dual specificity mitogen-activated protein kinase kinase MEK1/2 MAP kinase kinase 1 MAPK/ERK kinase 1 MEK-1 MP2K1_HUMAN PRKMK1 | VHL-MAP2K1/MAP2K2
Type:
Other Protein Type
Mol. Mass.:
43439.03
Organism:
Homo sapiens (Human)
Description:
Full-length human MEK-1 was generated by PCR and purified as a fusion protein from Escherichia coli lysates.
Residue:
393
  
Inhibitor
Name:
BDBM50494482
Synonyms:
CHEMBL3092191
Type:
Small organic molecule
Emp. Form.:
C21H22FN3O6S
Mol. Mass.:
463.479
SMILES:
CNS(=O)(=O)Nc1cccc(Cc2c(C)c3ccc(OC(=O)N(C)C)cc3oc2=O)c1F
: