Target
RAF proto-oncogene serine/threonine-protein kinase
Ligand
BDBM50010463
Substrate
Meas. Tech.
ChEMBL_1279377 (CHEMBL3096356)
IC50
23±n/a nM
Citation
 Hyohdoh, IFuruichi, NAoki, TItezono, YShirai, HOzawa, SWatanabe, FMatsushita, MSakaitani, MHo, PSTakanashi, KHarada, NTomii, YYoshinari, KOri, KTabo, MAoki, YShimma, NIikura, H Fluorine Scanning by Nonselective Fluorination: Enhancing Raf/MEK Inhibition while Keeping Physicochemical Properties. ACS Med Chem Lett 4:1059-63 (2013)  
Target
Name:
RAF proto-oncogene serine/threonine-protein kinase
Synonyms:
C-Raf Protein Kinase RAF RAF1 Raf-1 Serine/threonine-protein kinase C-Raf | cRaf
Type:
Serine/threonine-protein kinase
Mol. Mass.:
73082.52
Organism:
Homo sapiens (Human)
Description:
P04049
Residue:
648
  
Inhibitor
Name:
BDBM50010463
Synonyms:
CHEMBL3092195
Type:
Small organic molecule
Emp. Form.:
C22H19FN4O5S
Mol. Mass.:
470.473
SMILES:
CNS(=O)(=O)Nc1cccc(Cc2c(C)c3ccc(Oc4ncccn4)cc3oc2=O)c1F
: