Target
RAF proto-oncogene serine/threonine-protein kinase
Ligand
BDBM50443366
Substrate
Meas. Tech.
ChEMBL_1279377 (CHEMBL3096356)
IC50
8.0±n/a nM
Citation
 Hyohdoh, IFuruichi, NAoki, TItezono, YShirai, HOzawa, SWatanabe, FMatsushita, MSakaitani, MHo, PSTakanashi, KHarada, NTomii, YYoshinari, KOri, KTabo, MAoki, YShimma, NIikura, H Fluorine Scanning by Nonselective Fluorination: Enhancing Raf/MEK Inhibition while Keeping Physicochemical Properties. ACS Med Chem Lett 4:1059-63 (2013)  
Target
Name:
RAF proto-oncogene serine/threonine-protein kinase
Synonyms:
C-Raf Protein Kinase RAF RAF1 Raf-1 Serine/threonine-protein kinase C-Raf | cRaf
Type:
Serine/threonine-protein kinase
Mol. Mass.:
73082.52
Organism:
Homo sapiens (Human)
Description:
P04049
Residue:
648
  
Inhibitor
Name:
BDBM50443366
Synonyms:
CHEMBL3086065
Type:
Small organic molecule
Emp. Form.:
C21H22ClN3O6S
Mol. Mass.:
479.934
SMILES:
CNS(=O)(=O)Nc1cccc(Cc2c(C)c3cc(Cl)c(OC(=O)N(C)C)cc3oc2=O)c1
: