Target
Sodium-dependent dopamine transporter
Ligand
BDBM50007404
Substrate
Meas. Tech.
ChEMBL_1280659 (CHEMBL3097100)
Ki
0.040000±n/a nM
Citation
 Motel, WCHealy, JRViard, EPouw, BMartin, KMatsumoto, RRCoop, A Chlorophenylpiperazine analogues as high affinity dopamine transporter ligands. Bioorg Med Chem Lett 23:6920-6922 (2013)  
Target
Name:
Sodium-dependent dopamine transporter
Synonyms:
DA transporter SC6A3_RAT Sodium-dependent dopamine transporter | Sodium-dependent dopamine transporter (DAT)
Type:
Multi-pass membrane protein
Mol. Mass.:
68749.45
Organism:
Rattus norvegicus (rat)
Description:
P23977
Residue:
619
  
Inhibitor
Name:
BDBM50007404
Synonyms:
1-(3-Chloro-phenyl)-4-phenethyl-piperazine | CHEMBL113621
Type:
Small organic molecule
Emp. Form.:
C18H21ClN2
Mol. Mass.:
300.826
SMILES:
Clc1cccc(c1)N1CCN(CCc2ccccc2)CC1
: