Target
Lanosterol synthase
Ligand
BDBM50494929
Substrate
Meas. Tech.
ChEMBL_1283316 (CHEMBL3101581)
Ki
3.0±n/a nM
Citation
 Felczak, KVince, RPankiewicz, KW NAD-based inhibitors with anticancer potential. Bioorg Med Chem Lett 24:332-6 (2014)  
Target
Name:
Lanosterol synthase
Synonyms:
2,3-epoxysqualene--lanosterol cyclase LSS_HUMAN Oxidosqualene--lanosterol cyclase
Type:
PROTEIN
Mol. Mass.:
83309.32
Organism:
Homo sapiens (Human)
Description:
ChEMBL_11231
Residue:
732
  
Inhibitor
Name:
BDBM50494929
Synonyms:
CHEMBL3098184
Type:
Small organic molecule
Emp. Form.:
C32H41N7O9
Mol. Mass.:
667.7094
SMILES:
COc1c(C)c2COC(=O)c2c(O)c1C\C=C(/C)CCC(=O)N[C@H](C(C)C)C(=O)NC[C@H]1O[C@H]([C@H](O)[C@@H]1O)n1cnc2c(N)ncnc12
: