Target
Fibroblast growth factor receptor 1
Ligand
BDBM50420964
Substrate
Meas. Tech.
ChEMBL_1286960 (CHEMBL3111125)
Kd
68±n/a nM
Citation
 Klein, TTucker, JHoldgate, GANorman, RABreeze, AL FGFR1 Kinase Inhibitors: Close Regioisomers Adopt Divergent Binding Modes and Display Distinct Biophysical Signatures. ACS Med Chem Lett 5:166-71 (2014)  
Target
Name:
Fibroblast growth factor receptor 1
Synonyms:
BFGFR Basic fibroblast growth factor receptor 1 (FGFR1) CEK FGFR-1 FGFR-1, (FL) FGFR1_HUMAN FLT2 Fibroblast growth factor receptor 1 (FGFR-1) Fms-like tyrosine kinase 2 N-sam bFGF-R | c-fgr
Type:
Receptor
Mol. Mass.:
91861.70
Organism:
Homo sapiens (Human)
Description:
P11362
Residue:
822
  
Inhibitor
Name:
BDBM50420964
Synonyms:
CHEMBL2088100
Type:
Small organic molecule
Emp. Form.:
C20H21N7O
Mol. Mass.:
375.427
SMILES:
Cc1cc(CNc2nccc(Nc3cc(CCc4ccccc4)n[nH]3)n2)on1
: