Target
Cathepsin B
Ligand
BDBM50042435
Substrate
Meas. Tech.
ChEBML_47386
pH
5.2±n/a
Ki
400±n/a nM
Comments
extracted
Citation
 Li, ZPatil, GSGolubski, ZEHori, HTehrani, KForeman, JEEveleth, DDBartus, RTPowers, JC Peptide alpha-keto ester, alpha-keto amide, and alpha-keto acid inhibitors of calpains and other cysteine proteases. J Med Chem 36:3472-80 (1993)  
Target
Name:
Cathepsin B
Synonyms:
BCSB CTSB Cathepsin B1
Type:
Enzyme
Mol. Mass.:
36657.87
Organism:
Bos taurus (bovine)
Description:
Bovine spleen CB was purchased from Sigma Co. (USA).
Residue:
335
  
Inhibitor
Name:
BDBM50042435
Synonyms:
3-(2-Isobutoxycarbonylamino-4-methyl-pentanoylamino)-2-oxo-pentanoic acid ethyl ester | CHEMBL116264
Type:
Small organic molecule
Emp. Form.:
C18H32N2O6
Mol. Mass.:
372.4565
SMILES:
CCOC(=O)C(=O)C(CC)NC(=O)C(CC(C)C)NC(=O)OCC(C)C
: