Target
Polyunsaturated fatty acid 5-lipoxygenase
Ligand
BDBM50042493
Substrate
Meas. Tech.
ChEMBL_101349 (CHEMBL712607)
IC50
43±n/a nM
Citation
 Satoh, YStanton, JLHutchison, AJLibby, AHKowalski, TJLee, WHWhite, DHKimble, EF Substituted chromenes as potent, orally active 5-lipoxygenase inhibitors. J Med Chem 36:3580-94 (1994)  
Target
Name:
Polyunsaturated fatty acid 5-lipoxygenase
Synonyms:
5-LO 5-Lipoxygenase (5-LO) 5-Lipoygenase ALOX5 LOG5 | LOX5_HUMAN
Type:
Enzyme
Mol. Mass.:
77972.74
Organism:
Homo sapiens (Human)
Description:
Recombinant protein was purified from E. coli lysate. After ammonium sulfate precipitation and subsequent steps, the supernatant (S100) was used for 5-LO activity assay.
Residue:
674
  
Inhibitor
Name:
BDBM50042493
Synonyms:
CGS-23885 N-hydroxy-N-[(6-phenoxy-2H-chromen-3-yl)methyl]urea
Type:
Small organic molecule
Emp. Form.:
C17H16N2O4
Mol. Mass.:
312.3199
SMILES:
NC(=O)N(O)CC1=Cc2cc(Oc3ccccc3)ccc2OC1
: