Target
Polyunsaturated fatty acid lipoxygenase ALOX12
Ligand
BDBM50042493
Substrate
Meas. Tech.
ChEMBL_206 (CHEMBL615240)
IC50
640±n/a nM
Citation
 Satoh, YStanton, JLHutchison, AJLibby, AHKowalski, TJLee, WHWhite, DHKimble, EF Substituted chromenes as potent, orally active 5-lipoxygenase inhibitors. J Med Chem 36:3580-94 (1994)  
Target
Name:
Polyunsaturated fatty acid lipoxygenase ALOX12
Synonyms:
12-LOX 12LO Arachidonate 12-lipoxygenase LOG12 Platelet 12-lipoxygenase | Platelet-type lipoxygenase 12
Type:
Protein
Mol. Mass.:
75689.18
Organism:
Homo sapiens (Human)
Description:
P18054
Residue:
663
  
Inhibitor
Name:
BDBM50042493
Synonyms:
CGS-23885 N-hydroxy-N-[(6-phenoxy-2H-chromen-3-yl)methyl]urea
Type:
Small organic molecule
Emp. Form.:
C17H16N2O4
Mol. Mass.:
312.3199
SMILES:
NC(=O)N(O)CC1=Cc2cc(Oc3ccccc3)ccc2OC1
: