Target
Polyunsaturated fatty acid 5-lipoxygenase
Ligand
BDBM50042496
Substrate
Meas. Tech.
ChEBML_101349
IC50
310±n/a nM
Citation
 Satoh, YStanton, JLHutchison, AJLibby, AHKowalski, TJLee, WHWhite, DHKimble, EF Substituted chromenes as potent, orally active 5-lipoxygenase inhibitors. J Med Chem 36:3580-94 (1994)  
Target
Name:
Polyunsaturated fatty acid 5-lipoxygenase
Synonyms:
5-LO 5-Lipoxygenase (5-LO) 5-Lipoygenase ALOX5 LOG5 | LOX5_HUMAN
Type:
Enzyme
Mol. Mass.:
77972.74
Organism:
Homo sapiens (Human)
Description:
Recombinant protein was purified from E. coli lysate. After ammonium sulfate precipitation and subsequent steps, the supernatant (S100) was used for 5-LO activity assay.
Residue:
674
  
Inhibitor
Name:
BDBM50042496
Synonyms:
CHEMBL119499 | N-[(2,2-dimethyl-6-phenyoxy-2H-chromen-3-yl)methyl]-N-hydroxyurea
Type:
Small organic molecule
Emp. Form.:
C19H20N2O4
Mol. Mass.:
340.3731
SMILES:
CC1(C)Oc2ccc(Oc3ccccc3)cc2C=C1CN(O)C(N)=O
: