Target
5-hydroxytryptamine receptor 7
Ligand
BDBM50442745
Substrate
Meas. Tech.
ChEMBL_1290905 (CHEMBL3118687)
Kd
1.2±n/a nM
Citation
 Lacivita, ENiso, MHansen, HDDi Pilato, PHerth, MMLehel, SEttrup, AMontenegro, LPerrone, RBerardi, FColabufo, NALeopoldo, MKnudsen, GM Design, synthesis, radiolabeling and in vivo evaluation of potential positron emission tomography (PET) radioligands for brain imaging of the 5-HT? receptor. Bioorg Med Chem 22:1736-50 (2014)  
Target
Name:
5-hydroxytryptamine receptor 7
Synonyms:
5-HT-7 5-HT7 5-HT7S 5HT7 HTR7 | Serotonin receptor 7
Type:
G Protein-Coupled Receptor (GPCR)
Mol. Mass.:
53573.08
Organism:
Homo sapiens (Human)
Description:
P34969
Residue:
479
  
Inhibitor
Name:
BDBM50442745
Synonyms:
CHEMBL2442996
Type:
Small organic molecule
Emp. Form.:
C29H36N4O2
Mol. Mass.:
472.6217
SMILES:
COc1ccc(cc1)-c1ccccc1N1CCN(CCCCCC(=O)NCc2ccncc2)CC1
: