Target
Protease
Ligand
BDBM50495686
Substrate
Meas. Tech.
ChEMBL_1290254 (CHEMBL3118383)
Ki
257000±n/a nM
Citation
 Gros, GMartinez, LGimenez, ASAdler, PMaurin, PWolkowicz, RFalson, PHasserodt, J Modular construction of quaternary hemiaminal-based inhibitor candidates and their in cellulo assessment with HIV-1 protease. Bioorg Med Chem 21:5407-13 (2013)  
Target
Name:
Protease
Synonyms:
Type:
Enzyme
Mol. Mass.:
10904.79
Organism:
Human immunodeficiency virus 1 (HIV-1)
Description:
Q9YQ12
Residue:
99
  
Inhibitor
Name:
BDBM50495686
Synonyms:
CHEMBL3115090
Type:
Small organic molecule
Emp. Form.:
C22H27N3O2
Mol. Mass.:
365.4687
SMILES:
O=C[C@H](Cc1ccccc1)NC(=O)N(Cc1ccccc1)N1CCCCC1
: