Target
Protease
Ligand
BDBM50495685
Substrate
Meas. Tech.
ChEMBL_1290253 (CHEMBL3118382)
Ki
492000±n/a nM
Citation
 Gros, GMartinez, LGimenez, ASAdler, PMaurin, PWolkowicz, RFalson, PHasserodt, J Modular construction of quaternary hemiaminal-based inhibitor candidates and their in cellulo assessment with HIV-1 protease. Bioorg Med Chem 21:5407-13 (2013)  
Target
Name:
Protease
Synonyms:
Type:
Enzyme
Mol. Mass.:
10904.79
Organism:
Human immunodeficiency virus 1 (HIV-1)
Description:
Q9YQ12
Residue:
99
  
Inhibitor
Name:
BDBM50495685
Synonyms:
CHEMBL3115089
Type:
Small organic molecule
Emp. Form.:
C19H23N3O2
Mol. Mass.:
325.4048
SMILES:
CN(C)N(Cc1ccccc1)C(=O)N[C@@H](Cc1ccccc1)C=O
: