Target
Protease
Ligand
BDBM50495680
Substrate
Meas. Tech.
ChEMBL_1290254 (CHEMBL3118383)
Ki
242000±n/a nM
Citation
 Gros, GMartinez, LGimenez, ASAdler, PMaurin, PWolkowicz, RFalson, PHasserodt, J Modular construction of quaternary hemiaminal-based inhibitor candidates and their in cellulo assessment with HIV-1 protease. Bioorg Med Chem 21:5407-13 (2013)  
Target
Name:
Protease
Synonyms:
Type:
Enzyme
Mol. Mass.:
10904.79
Organism:
Human immunodeficiency virus 1 (HIV-1)
Description:
Q9YQ12
Residue:
99
  
Inhibitor
Name:
BDBM50495680
Synonyms:
CHEMBL3115093
Type:
Small organic molecule
Emp. Form.:
C22H27N3O3
Mol. Mass.:
381.4681
SMILES:
Oc1cccc(CN(N2CCCCC2)C(=O)N[C@@H](Cc2ccccc2)C=O)c1
: