Target
Protease
Ligand
BDBM50496362
Substrate
Meas. Tech.
ChEMBL_1298586 (CHEMBL3132373)
IC50
1900±n/a nM
Citation
 Parra, AMartin-Fonseca, SRivas, FReyes-Zurita, FJMedina-O'Donnell, MMartinez, AGarcia-Granados, ALupiaņez, JAAlbericio, F Semi-synthesis of acylated triterpenes from olive-oil industry wastes for the development of anticancer and anti-HIV agents. Eur J Med Chem 74:278-301 (2014)  
Target
Name:
Protease
Synonyms:
Type:
Enzyme
Mol. Mass.:
10904.79
Organism:
Human immunodeficiency virus 1 (HIV-1)
Description:
Q9YQ12
Residue:
99
  
Inhibitor
Name:
BDBM50496362
Synonyms:
CHEMBL3126461
Type:
Small organic molecule
Emp. Form.:
C53H62O10
Mol. Mass.:
859.0534
SMILES:
[H][C@@]12CC(C)(C)CC[C@@]1(CC[C@]1(C)C2=CC[C@]2([H])[C@@]3(C)C[C@@H](OC(=O)c4ccccc4C(O)=O)[C@H](OC(=O)c4ccccc4C(O)=O)C(C)(C)[C@]3([H])CC[C@@]12C)C(=O)OCc1ccccc1
: